Xfce Forum

Sub domains
 

You are not logged in.

#1 2007-02-01 15:06:52

yongyi
Member
Registered: 2007-01-28
Posts: 16

[SOLVED]slk11.0 install Thunar-Bundle-0.8.0-installer.run error

another,I want ask:
I have installed xfce4-4.4.0-installer.run. Have I still install Thunar-Bundle-0.8.0-installer.run and xfce-goodies-4.4.0-installer.run??
sorry my poor English. smile

## Building Thunar-0.8.0
...........

..........

storage -lhal -ldbus-1   -ldbus-glib-1 -ldbus-1 -lglib-2.0   
thunar-vfs-font-thumbnailer.c:60: error: syntax error before "error"
thunar-vfs-font-thumbnailer.c: In function `tft_ft_strerror':
thunar-vfs-font-thumbnailer.c:66: error: `error' undeclared (first use in this function)
thunar-vfs-font-thumbnailer.c:66: error: (Each undeclared identifier is reported only once
thunar-vfs-font-thumbnailer.c:66: error: for each function it appears in.)
In file included from /usr/include/freetype2/freetype/fterrors.h:172,
                 from thunar-vfs-font-thumbnailer.c:68:
/usr/include/freetype2/freetype/fterrdef.h:34: error: `FT_Err_Ok' undeclared (first use in this function)
/usr/include/freetype2/freetype/fterrdef.h:37: error: `FT_Err_Cannot_Open_Resource' undeclared (first use in this function)
/usr/include/freetype2/freetype/fterrdef.h:39: error: `FT_Err_Unknown_File_Format' undeclared (first use in this function)
/usr/include/freetype2/freetype/fterrdef.h:41: error: `FT_Err_Invalid_File_Format' undeclared (first use in this function)
/usr/include/freetype2/freetype/fterrdef.h:43: error: `FT_Err_Invalid_Version' undeclared (first use in this function)
/usr/include/freetype2/freetype/fterrdef.h:45: error: `FT_Err_Lower_Module_Version' undeclared (first use in this function)
/usr/include/freetype2/freetype/fterrdef.h:47: error: `FT_Err_Invalid_Argument' undeclared (first use in this function)
/usr/include/freetype2/freetype/fterrdef.h:49: error: `FT_Err_Unimplemented_Feature' undeclared (first use in this function)
/usr/include/freetype2/freetype/fterrdef.h:51: error: `FT_Err_Invalid_Table' undeclared (first use in this function)
/usr/include/freetype2/freetype/fterrdef.h:53: error: `FT_Err_Invalid_Offset' undeclared (first use in this function)
/usr/include/freetype2/freetype/fterrdef.h:58: error: `FT_Err_Invalid_Glyph_Index' undeclared (first use in this function)
/usr/include/freetype2/freetype/fterrdef.h:60: error: `FT_Err_Invalid_Character_Code' undeclared (first use in this function)
/usr/include/freetype2/freetype/fterrdef.h:62: error: `FT_Err_Invalid_Glyph_Format' undeclared (first use in this function)
/usr/include/freetype2/freetype/fterrdef.h:64: error: `FT_Err_Cannot_Render_Glyph' undeclared (first use in this function)
/usr/include/freetype2/freetype/fterrdef.h:66: error: `FT_Err_Invalid_Outline' undeclared (first use in this function)
/usr/include/freetype2/freetype/fterrdef.h:68: error: `FT_Err_Invalid_Composite' undeclared (first use in this function)
/usr/include/freetype2/freetype/fterrdef.h:70: error: `FT_Err_Too_Many_Hints' undeclared (first use in this function)
/usr/include/freetype2/freetype/fterrdef.h:72: error: `FT_Err_Invalid_Pixel_Size' undeclared (first use in this function)
/usr/include/freetype2/freetype/fterrdef.h:77: error: `FT_Err_Invalid_Handle' undeclared (first use in this function)
/usr/include/freetype2/freetype/fterrdef.h:79: error: `FT_Err_Invalid_Library_Handle' undeclared (first use in this function)
/usr/include/freetype2/freetype/fterrdef.h:81: error: `FT_Err_Invalid_Driver_Handle' undeclared (first use in this function)
/usr/include/freetype2/freetype/fterrdef.h:83: error: `FT_Err_Invalid_Face_Handle' undeclared (first use in this function)
/usr/include/freetype2/freetype/fterrdef.h:85: error: `FT_Err_Invalid_Size_Handle' undeclared (first use in this function)
/usr/include/freetype2/freetype/fterrdef.h:87: error: `FT_Err_Invalid_Slot_Handle' undeclared (first use in this function)
/usr/include/freetype2/freetype/fterrdef.h:89: error: `FT_Err_Invalid_CharMap_Handle' undeclared (first use in this function)
/usr/include/freetype2/freetype/fterrdef.h:91: error: `FT_Err_Invalid_Cache_Handle' undeclared (first use in this function)
/usr/include/freetype2/freetype/fterrdef.h:93: error: `FT_Err_Invalid_Stream_Handle' undeclared (first use in this function)
/usr/include/freetype2/freetype/fterrdef.h:98: error: `FT_Err_Too_Many_Drivers' undeclared (first use in this function)
/usr/include/freetype2/freetype/fterrdef.h:100: error: `FT_Err_Too_Many_Extensions' undeclared (first use in this function)
/usr/include/freetype2/freetype/fterrdef.h:105: error: `FT_Err_Out_Of_Memory' undeclared (first use in this function)
/usr/include/freetype2/freetype/fterrdef.h:107: error: `FT_Err_Unlisted_Object' undeclared (first use in this function)
/usr/include/freetype2/freetype/fterrdef.h:112: error: `FT_Err_Cannot_Open_Stream' undeclared (first use in this function)
/usr/include/freetype2/freetype/fterrdef.h:114: error: `FT_Err_Invalid_Stream_Seek' undeclared (first use in this function)
/usr/include/freetype2/freetype/fterrdef.h:116: error: `FT_Err_Invalid_Stream_Skip' undeclared (first use in this function)
/usr/include/freetype2/freetype/fterrdef.h:118: error: `FT_Err_Invalid_Stream_Read' undeclared (first use in this function)
/usr/include/freetype2/freetype/fterrdef.h:120: error: `FT_Err_Invalid_Stream_Operation' undeclared (first use in this function)
/usr/include/freetype2/freetype/fterrdef.h:122: error: `FT_Err_Invalid_Frame_Operation' undeclared (first use in this function)
/usr/include/freetype2/freetype/fterrdef.h:124: error: `FT_Err_Nested_Frame_Access' undeclared (first use in this function)
/usr/include/freetype2/freetype/fterrdef.h:126: error: `FT_Err_Invalid_Frame_Read' undeclared (first use in this function)
/usr/include/freetype2/freetype/fterrdef.h:131: error: `FT_Err_Raster_Uninitialized' undeclared (first use in this function)
/usr/include/freetype2/freetype/fterrdef.h:133: error: `FT_Err_Raster_Corrupted' undeclared (first use in this function)
/usr/include/freetype2/freetype/fterrdef.h:135: error: `FT_Err_Raster_Overflow' undeclared (first use in this function)
/usr/include/freetype2/freetype/fterrdef.h:137: error: `FT_Err_Raster_Negative_Height' undeclared (first use in this function)
/usr/include/freetype2/freetype/fterrdef.h:142: error: `FT_Err_Too_Many_Caches' undeclared (first use in this function)
/usr/include/freetype2/freetype/fterrdef.h:147: error: `FT_Err_Invalid_Opcode' undeclared (first use in this function)
/usr/include/freetype2/freetype/fterrdef.h:149: error: `FT_Err_Too_Few_Arguments' undeclared (first use in this function)
/usr/include/freetype2/freetype/fterrdef.h:151: error: `FT_Err_Stack_Overflow' undeclared (first use in this function)
/usr/include/freetype2/freetype/fterrdef.h:153: error: `FT_Err_Code_Overflow' undeclared (first use in this function)
/usr/include/freetype2/freetype/fterrdef.h:155: error: `FT_Err_Bad_Argument' undeclared (first use in this function)
/usr/include/freetype2/freetype/fterrdef.h:157: error: `FT_Err_Divide_By_Zero' undeclared (first use in this function)
/usr/include/freetype2/freetype/fterrdef.h:159: error: `FT_Err_Invalid_Reference' undeclared (first use in this function)
/usr/include/freetype2/freetype/fterrdef.h:161: error: `FT_Err_Debug_OpCode' undeclared (first use in this function)
/usr/include/freetype2/freetype/fterrdef.h:163: error: `FT_Err_ENDF_In_Exec_Stream' undeclared (first use in this function)
/usr/include/freetype2/freetype/fterrdef.h:165: error: `FT_Err_Nested_DEFS' undeclared (first use in this function)
/usr/include/freetype2/freetype/fterrdef.h:167: error: `FT_Err_Invalid_CodeRange' undeclared (first use in this function)
/usr/include/freetype2/freetype/fterrdef.h:169: error: `FT_Err_Execution_Too_Long' undeclared (first use in this function)
/usr/include/freetype2/freetype/fterrdef.h:171: error: `FT_Err_Too_Many_Function_Defs' undeclared (first use in this function)
/usr/include/freetype2/freetype/fterrdef.h:173: error: `FT_Err_Too_Many_Instruction_Defs' undeclared (first use in this function)
/usr/include/freetype2/freetype/fterrdef.h:175: error: `FT_Err_Table_Missing' undeclared (first use in this function)
/usr/include/freetype2/freetype/fterrdef.h:177: error: `FT_Err_Horiz_Header_Missing' undeclared (first use in this function)
/usr/include/freetype2/freetype/fterrdef.h:179: error: `FT_Err_Locations_Missing' undeclared (first use in this function)
/usr/include/freetype2/freetype/fterrdef.h:181: error: `FT_Err_Name_Table_Missing' undeclared (first use in this function)
/usr/include/freetype2/freetype/fterrdef.h:183: error: `FT_Err_CMap_Table_Missing' undeclared (first use in this function)
/usr/include/freetype2/freetype/fterrdef.h:185: error: `FT_Err_Hmtx_Table_Missing' undeclared (first use in this function)
/usr/include/freetype2/freetype/fterrdef.h:187: error: `FT_Err_Post_Table_Missing' undeclared (first use in this function)
/usr/include/freetype2/freetype/fterrdef.h:189: error: `FT_Err_Invalid_Horiz_Metrics' undeclared (first use in this function)
/usr/include/freetype2/freetype/fterrdef.h:191: error: `FT_Err_Invalid_CharMap_Format' undeclared (first use in this function)
/usr/include/freetype2/freetype/fterrdef.h:193: error: `FT_Err_Invalid_PPem' undeclared (first use in this function)
/usr/include/freetype2/freetype/fterrdef.h:195: error: `FT_Err_Invalid_Vert_Metrics' undeclared (first use in this function)
/usr/include/freetype2/freetype/fterrdef.h:197: error: `FT_Err_Could_Not_Find_Context' undeclared (first use in this function)
/usr/include/freetype2/freetype/fterrdef.h:199: error: `FT_Err_Invalid_Post_Table_Format' undeclared (first use in this function)
/usr/include/freetype2/freetype/fterrdef.h:201: error: `FT_Err_Invalid_Post_Table' undeclared (first use in this function)
/usr/include/freetype2/freetype/fterrdef.h:206: error: `FT_Err_Syntax_Error' undeclared (first use in this function)
/usr/include/freetype2/freetype/fterrdef.h:208: error: `FT_Err_Stack_Underflow' undeclared (first use in this function)
/usr/include/freetype2/freetype/fterrdef.h:210: error: `FT_Err_Ignore' undeclared (first use in this function)
/usr/include/freetype2/freetype/fterrdef.h:215: error: `FT_Err_Missing_Startfont_Field' undeclared (first use in this function)
/usr/include/freetype2/freetype/fterrdef.h:217: error: `FT_Err_Missing_Font_Field' undeclared (first use in this function)
/usr/include/freetype2/freetype/fterrdef.h:219: error: `FT_Err_Missing_Size_Field' undeclared (first use in this function)
/usr/include/freetype2/freetype/fterrdef.h:221: error: `FT_Err_Missing_Chars_Field' undeclared (first use in this function)
/usr/include/freetype2/freetype/fterrdef.h:223: error: `FT_Err_Missing_Startchar_Field' undeclared (first use in this function)
/usr/include/freetype2/freetype/fterrdef.h:225: error: `FT_Err_Missing_Encoding_Field' undeclared (first use in this function)
/usr/include/freetype2/freetype/fterrdef.h:227: error: `FT_Err_Missing_Bbx_Field' undeclared (first use in this function)
thunar-vfs-font-thumbnailer.c: At top level:
thunar-vfs-font-thumbnailer.c:79: error: syntax error before "FT_Face"
thunar-vfs-font-thumbnailer.c: In function `tft_render_glyph':
thunar-vfs-font-thumbnailer.c:84: error: `FT_GlyphSlot' undeclared (first use in this function)
thunar-vfs-font-thumbnailer.c:84: error: syntax error before "slot"
thunar-vfs-font-thumbnailer.c:85: error: `FT_Error' undeclared (first use in this function)
thunar-vfs-font-thumbnailer.c:97: error: `error' undeclared (first use in this function)
thunar-vfs-font-thumbnailer.c:97: error: `face' undeclared (first use in this function)
thunar-vfs-font-thumbnailer.c:97: error: `glyph' undeclared (first use in this function)
thunar-vfs-font-thumbnailer.c:97: error: `FT_LOAD_DEFAULT' undeclared (first use in this function)
thunar-vfs-font-thumbnailer.c:105: error: `slot' undeclared (first use in this function)
thunar-vfs-font-thumbnailer.c:105: error: `ft_render_mode_normal' undeclared (first use in this function)
thunar-vfs-font-thumbnailer.c:112: error: `pen_x' undeclared (first use in this function)
thunar-vfs-font-thumbnailer.c:113: error: `pen_y' undeclared (first use in this function)
thunar-vfs-font-thumbnailer.c:115: error: `pixbuf' undeclared (first use in this function)
thunar-vfs-font-thumbnailer.c:132: error: `ft_pixel_mode_mono' undeclared (first use in this function)
thunar-vfs-font-thumbnailer.c:137: error: `ft_pixel_mode_grays' undeclared (first use in this function)
thunar-vfs-font-thumbnailer.c: In function `main':
thunar-vfs-font-thumbnailer.c:318: error: `FT_Library' undeclared (first use in this function)
thunar-vfs-font-thumbnailer.c:318: error: syntax error before "library"
thunar-vfs-font-thumbnailer.c:320: error: `FT_Error' undeclared (first use in this function)
thunar-vfs-font-thumbnailer.c:320: error: syntax error before "error"
thunar-vfs-font-thumbnailer.c:321: error: `FT_UInt' undeclared (first use in this function)
thunar-vfs-font-thumbnailer.c:323: error: `FT_Face' undeclared (first use in this function)
thunar-vfs-font-thumbnailer.c:361: error: `error' undeclared (first use in this function)
thunar-vfs-font-thumbnailer.c:361: error: `library' undeclared (first use in this function)
thunar-vfs-font-thumbnailer.c:369: error: `face' undeclared (first use in this function)
thunar-vfs-font-thumbnailer.c:389: error: `ft_encoding_latin_1' undeclared (first use in this function)
thunar-vfs-font-thumbnailer.c:390: error: `ft_encoding_unicode' undeclared (first use in this function)
thunar-vfs-font-thumbnailer.c:390: error: `ft_encoding_apple_roman' undeclared (first use in this function)
thunar-vfs-font-thumbnailer.c:404: error: `glyph1' undeclared (first use in this function)
thunar-vfs-font-thumbnailer.c:407: error: `glyph2' undeclared (first use in this function)
gmake[3]: *** [thunar_vfs_font_thumbnailer_1-thunar-vfs-font-thumbnailer.o] 错误 1
gmake[3]: *** 正在等待未完成的任务....
generating symbol list for `libthunar-vfs-1.la'
/usr/bin/nm -B  .libs/libthunar_vfs_1_la-thunar-vfs-volume-hal.o .libs/libthunar_vfs_1_la-thunar-vfs-aliasdef.o .libs/libthunar_vfs_1_la-thunar-vfs-enum-types.o .libs/libthunar_vfs_1_la-thunar-vfs-marshal.o .libs/libthunar_vfs_1_la-thunar-vfs-io-jobs.o .libs/libthunar_vfs_1_la-thunar-vfs-io-local.o .libs/libthunar_vfs_1_la-thunar-vfs-io-local-xfer.o .libs/libthunar_vfs_1_la-thunar-vfs-io-ops.o .libs/libthunar_vfs_1_la-thunar-vfs-io-scandir.o .libs/libthunar_vfs_1_la-thunar-vfs-io-trash.o .libs/libthunar_vfs_1_la-thunar-vfs-os-generic.o .libs/libthunar_vfs_1_la-thunar-vfs-config.o .libs/libthunar_vfs_1_la-thunar-vfs-deep-count-job.o .libs/libthunar_vfs_1_la-thunar-vfs-exec.o .libs/libthunar_vfs_1_la-thunar-vfs-info.o .libs/libthunar_vfs_1_la-thunar-vfs-interactive-job.o .libs/libthunar_vfs_1_la-thunar-vfs-job.o .libs/libthunar_vfs_1_la-thunar-vfs-mime-action.o .libs/libthunar_vfs_1_la-thunar-vfs-mime-application.o .libs/libthunar_vfs_1_la-thunar-vfs-mime-cache.o .libs/libthunar_vfs_1_la-thunar-vfs-mime-database.o .libs/libthunar_vfs_1_la-thunar-vfs-mime-handler.o .libs/libthunar_vfs_1_la-thunar-vfs-mime-info.o .libs/libthunar_vfs_1_la-thunar-vfs-mime-legacy.o .libs/libthunar_vfs_1_la-thunar-vfs-mime-parser.o .libs/libthunar_vfs_1_la-thunar-vfs-mime-provider.o .libs/libthunar_vfs_1_la-thunar-vfs-mime-sniffer.o .libs/libthunar_vfs_1_la-thunar-vfs-monitor.o .libs/libthunar_vfs_1_la-thunar-vfs-path.o .libs/libthunar_vfs_1_la-thunar-vfs-private.o .libs/libthunar_vfs_1_la-thunar-vfs-simple-job.o .libs/libthunar_vfs_1_la-thunar-vfs-thumb-jpeg.o .libs/libthunar_vfs_1_la-thunar-vfs-thumb.o .libs/libthunar_vfs_1_la-thunar-vfs-transfer-job.o .libs/libthunar_vfs_1_la-thunar-vfs-user.o .libs/libthunar_vfs_1_la-thunar-vfs-util.o .libs/libthunar_vfs_1_la-thunar-vfs-volume.o .libs/libthunar_vfs_1_la-thunar-vfs-volume-manager.o .libs/libthunar_vfs_1_la-thunar-vfs.o  | sed -n -e 's/^.*[     ]\([ABCDGIRSTW][ABCDGIRSTW]*\)[     ][     ]*\(\)\([_A-Za-z][_A-Za-z0-9]*\)$/\1 \2\3 \3/p' | /usr/bin/sed 's/.* //' | sort | uniq > .libs/libthunar-vfs-1.exp
grep -E -e "^[^_].*" ".libs/libthunar-vfs-1.exp" > ".libs/libthunar-vfs-1.expT"
mv -f ".libs/libthunar-vfs-1.expT" ".libs/libthunar-vfs-1.exp"
echo "{ global:" > .libs/libthunar-vfs-1.ver
 cat .libs/libthunar-vfs-1.exp | sed -e "s/\(.*\)/\1;/" >> .libs/libthunar-vfs-1.ver
 echo "local: *; };" >> .libs/libthunar-vfs-1.ver
 gcc -shared  .libs/libthunar_vfs_1_la-thunar-vfs-volume-hal.o .libs/libthunar_vfs_1_la-thunar-vfs-aliasdef.o .libs/libthunar_vfs_1_la-thunar-vfs-enum-types.o .libs/libthunar_vfs_1_la-thunar-vfs-marshal.o .libs/libthunar_vfs_1_la-thunar-vfs-io-jobs.o .libs/libthunar_vfs_1_la-thunar-vfs-io-local.o .libs/libthunar_vfs_1_la-thunar-vfs-io-local-xfer.o .libs/libthunar_vfs_1_la-thunar-vfs-io-ops.o .libs/libthunar_vfs_1_la-thunar-vfs-io-scandir.o .libs/libthunar_vfs_1_la-thunar-vfs-io-trash.o .libs/libthunar_vfs_1_la-thunar-vfs-os-generic.o .libs/libthunar_vfs_1_la-thunar-vfs-config.o .libs/libthunar_vfs_1_la-thunar-vfs-deep-count-job.o .libs/libthunar_vfs_1_la-thunar-vfs-exec.o .libs/libthunar_vfs_1_la-thunar-vfs-info.o .libs/libthunar_vfs_1_la-thunar-vfs-interactive-job.o .libs/libthunar_vfs_1_la-thunar-vfs-job.o .libs/libthunar_vfs_1_la-thunar-vfs-mime-action.o .libs/libthunar_vfs_1_la-thunar-vfs-mime-application.o .libs/libthunar_vfs_1_la-thunar-vfs-mime-cache.o .libs/libthunar_vfs_1_la-thunar-vfs-mime-database.o .libs/libthunar_vfs_1_la-thunar-vfs-mime-handler.o .libs/libthunar_vfs_1_la-thunar-vfs-mime-info.o .libs/libthunar_vfs_1_la-thunar-vfs-mime-legacy.o .libs/libthunar_vfs_1_la-thunar-vfs-mime-parser.o .libs/libthunar_vfs_1_la-thunar-vfs-mime-provider.o .libs/libthunar_vfs_1_la-thunar-vfs-mime-sniffer.o .libs/libthunar_vfs_1_la-thunar-vfs-monitor.o .libs/libthunar_vfs_1_la-thunar-vfs-path.o .libs/libthunar_vfs_1_la-thunar-vfs-private.o .libs/libthunar_vfs_1_la-thunar-vfs-simple-job.o .libs/libthunar_vfs_1_la-thunar-vfs-thumb-jpeg.o .libs/libthunar_vfs_1_la-thunar-vfs-thumb.o .libs/libthunar_vfs_1_la-thunar-vfs-transfer-job.o .libs/libthunar_vfs_1_la-thunar-vfs-user.o .libs/libthunar_vfs_1_la-thunar-vfs-util.o .libs/libthunar_vfs_1_la-thunar-vfs-volume.o .libs/libthunar_vfs_1_la-thunar-vfs-volume-manager.o .libs/libthunar_vfs_1_la-thunar-vfs.o  -L/usr/X11R6/lib -L/usr/lib /usr/lib/libexo-0.3.so /usr/lib/libgtk-x11-2.0.so /usr/lib/libxfce4util.so /usr/lib/libgdk-x11-2.0.so /usr/lib/libatk-1.0.so /usr/lib/libgdk_pixbuf-2.0.so /usr/lib/libpangocairo-1.0.so /usr/lib/libpango-1.0.so /usr/lib/libcairo.so /usr/lib/libgobject-2.0.so /usr/lib/libgmodule-2.0.so -ldl -pthread /usr/lib/libgthread-2.0.so -ljpeg -lm -lpng12 /usr/lib/libstartup-notification-1.so /usr/lib/libexo-hal-0.3.so /usr/lib/libhal-storage.so /usr/lib/libhal.so /usr/lib/libdbus-glib-1.so /usr/lib/libdbus-1.so /usr/lib/libglib-2.0.so  -Wl,-rpath -Wl,/usr/lib -Wl,--as-needed -Wl,-O1 -Wl,-soname -Wl,libthunar-vfs-1.so.2 -Wl,-version-script -Wl,.libs/libthunar-vfs-1.ver -o .libs/libthunar-vfs-1.so.2.2.2
(cd .libs && rm -f libthunar-vfs-1.so.2 && ln -s libthunar-vfs-1.so.2.2.2 libthunar-vfs-1.so.2)
(cd .libs && rm -f libthunar-vfs-1.so && ln -s libthunar-vfs-1.so.2.2.2 libthunar-vfs-1.so)
creating libthunar-vfs-1.la
(cd .libs && rm -f libthunar-vfs-1.la && ln -s ../libthunar-vfs-1.la libthunar-vfs-1.la)
gmake[3]: Leaving directory `/tmp/Thunar-Bundle-0.8.0-installer/Thunar-0.8.0/thunar-vfs'
gmake[2]: *** [all] 错误 2
gmake[2]: Leaving directory `/tmp/Thunar-Bundle-0.8.0-installer/Thunar-0.8.0/thunar-vfs'
gmake[1]: *** [all-recursive] 错误 1
gmake[1]: Leaving directory `/tmp/Thunar-Bundle-0.8.0-installer/Thunar-0.8.0'
gmake: *** [all] 错误 2
!! Failed to build Thunar-0.8.0, see the errors above
!! for details on the problem.

Offline

#2 2007-02-01 15:36:03

Nick
Dev
From: ~
Registered: 2005-02-17
Posts: 1,143
Website

Re: [SOLVED]slk11.0 install Thunar-Bundle-0.8.0-installer.run error

Your freetype installation is broken, maybe you're using an old version.

Offline

#3 2007-02-01 16:24:52

yongyi
Member
Registered: 2007-01-28
Posts: 16

Re: [SOLVED]slk11.0 install Thunar-Bundle-0.8.0-installer.run error

Nick wrote:

Your freetype installation is broken, maybe you're using an old version.

thanks!
yes. my freetype is freetype-2.1.9

I must upgrade freetype to the lasted version?

and,can you tell me:
what's different about xfce4-4.4.0-installer.run,Thunar-Bundle-0.8.0-installer.run and xfce-goodies-4.4.0-installer.run??
Thunar-Bundle-0.8.0-installer.run and xfce-goodies-4.4.0-installer.run  is content in xfce4-4.4.0-installer.run??

Offline

#4 2007-02-02 04:49:37

yongyi
Member
Registered: 2007-01-28
Posts: 16

Re: [SOLVED]slk11.0 install Thunar-Bundle-0.8.0-installer.run error

solved!I install freetype-2.3.1.

Offline

#5 2007-02-02 07:45:55

Nick
Dev
From: ~
Registered: 2005-02-17
Posts: 1,143
Website

Re: [SOLVED]slk11.0 install Thunar-Bundle-0.8.0-installer.run error

xfce4-4.4.0-installer.run
All Xfce components without any goodies.

Thunar-Bundle-0.8.0-installer.run
3 packages that are also in the installer (Thunar, Exo and libxfce4util) + Thunar goodies: thunar-archive-plugin thunar-media-tags-plugin thunar-volman

xfce-goodies-4.4.0-installer.run
Xfce panel plugins and some useful applications. Non of them are in the Xfce installer.

Offline

#6 2007-02-02 14:10:29

yongyi
Member
Registered: 2007-01-28
Posts: 16

Re: [SOLVED]slk11.0 install Thunar-Bundle-0.8.0-installer.run error

I see. Thank u.  ;D

Offline

Board footer

Powered by FluxBB